Reaction Details
TargetSerine/threonine-protein phosphatase
LigandBDBM37653
Substrate/Competitorn/a
Meas. Tech.Luminesence Cell-Based Secondary Assay to Identify Inhibitors of Calcineurin
EC50 180000±n/a nM
Citation PubChem, PC Luminesence Cell-Based Secondary Assay to Identify Inhibitors of Calcineurin PubChem Bioassay(2010)[AID]
 
Serine/threonine-protein phosphatase
Name:Serine/threonine-protein phosphatase
Type:Enzyme Catalytic Domain
Mol. Mass.:69558.03
Organism:Candida dubliniensis CD36
Description:gi_223640082
Residue:607
BDBM37653
NameBDBM37653
Synonyms:3-(1-benzofuran-2-carbonyl)-2-(2,3-dimethoxyphenyl)-4-hydroxy-1-(5-methyl-1,2-oxazol-3-yl)-2H-pyrrol-5-one 3-[2-benzofuranyl(oxo)methyl]-2-(2,3-dimethoxyphenyl)-4-hydroxy-1-(5-methyl-3-isoxazolyl)-2H-pyrrol-5-one MLS000040232 cid_661999
TypeSmall organic molecule
Emp. Form.C25H20N2O7
Mol. Mass.460.4355
SMILESCOc1cccc(C2C(C(=O)c3cc4ccccc4o3)C(=O)C(=O)N2c2cc(C)on2)c1OC