Reaction Details
TargetSerine/threonine-protein phosphatase
LigandBDBM64544
Substrate/Competitorn/a
Meas. Tech.Luminesence Cell-Based Secondary Assay to Identify Inhibitors of Calcineurin
EC50 180000±n/a nM
Citation PubChem, PC Luminesence Cell-Based Secondary Assay to Identify Inhibitors of Calcineurin PubChem Bioassay(2010)[AID]
 
Serine/threonine-protein phosphatase
Name:Serine/threonine-protein phosphatase
Type:Enzyme Catalytic Domain
Mol. Mass.:69558.03
Organism:Candida dubliniensis CD36
Description:gi_223640082
Residue:607
BDBM64544
NameBDBM64544
Synonyms:7-[(1,3-benzothiazol-2-ylamino)-(2-furanyl)methyl]-8-quinolinol 7-[(1,3-benzothiazol-2-ylamino)-(furan-2-yl)methyl]quinolin-8-ol SMR000060957 | cid_2998355
TypeSmall organic molecule
Emp. Form.C21H15N3O2S
Mol. Mass.373.428
SMILESOc1c(ccc2cccnc12)C(Nc1nc2ccccc2s1)c1ccco1