Reaction Details
TargetSerine/threonine-protein phosphatase
LigandBDBM38968
Substrate/Competitorn/a
Meas. Tech.Luminesence Cell-Based Secondary Assay to Identify Inhibitors of Calcineurin
EC50 180000±n/a nM
Citation PubChem, PC Luminesence Cell-Based Secondary Assay to Identify Inhibitors of Calcineurin PubChem Bioassay(2010)[AID]
 
Serine/threonine-protein phosphatase
Name:Serine/threonine-protein phosphatase
Type:Enzyme Catalytic Domain
Mol. Mass.:69558.03
Organism:Candida dubliniensis CD36
Description:gi_223640082
Residue:607
BDBM38968
NameBDBM38968
Synonyms:MLS000086346 N-[5-(5-chloro-2-thienyl)-1,3,4-oxadiazol-2-yl]-4-(4,4-dimethyloxazolidin-3-yl)sulfonyl-benzamide N-[5-(5-chlorothien-2-yl)-1,3,4-oxadiazol-2-yl]-4-[(4,4-dimethyl-1,3-oxazolidin-3-yl)sulfonyl]benzamide SMR000021848 | cid_2159039
TypeSmall organic molecule
Emp. Form.C18H17ClN4O5S2
Mol. Mass.468.934
SMILESCC1(C)COCN1S(=O)(=O)c1ccc(cc1)C(=O)Nc1nnc(o1)-c1ccc(Cl)s1