Reaction Details
TargetSerine/threonine-protein phosphatase
LigandBDBM47968
Substrate/Competitorn/a
Meas. Tech.Fluorescence-based biochemical high throughput dose response assay for inhibitors of Protein Phosphatase 5 (PP5)
IC50 12306±n/a nM
Citation PubChem, PC Fluorescence-based biochemical high throughput dose response assay for inhibitors of Protein Phosphatase 5 (PP5) PubChem Bioassay(2010)[AID]
 
Serine/threonine-protein phosphatase
Name:Serine/threonine-protein phosphatase
Type:Enzyme Catalytic Domain
Mol. Mass.:55092.68
Organism:Homo sapiens (Human)
Description:gi_37589898
Residue:484
BDBM47968
NameBDBM47968
Synonyms:MLS000686315 N-[4-[(1-oxidanylidene-4-thiophen-2-ylsulfonylimino-naphthalen-2-yl)amino]phenyl]ethanamide N-[4-[(1-oxo-4-thiophen-2-ylsulfonyliminonaphthalen-2-yl)amino]phenyl]acetamide N-[4-[[1-keto-4-(2-thienylsulfonylimino)-2-naphthyl]amino]phenyl]acetamide cid_3715121
TypeSmall organic molecule
Emp. Form.C22H17N3O4S2
Mol. Mass.451.518
SMILESCC(=O)Nc1ccc(NC2=CC(=NS(=O)(=O)c3cccs3)c3ccccc3C2=O)cc1