Reaction Details
TargetTrans-activator protein BZLF1
LigandBDBM54791
Substrate/Competitorn/a
Meas. Tech.Counterscreen for inhibitors of PP1: fluorescence-based biochemical high throughput dose response assay to identify inhibitors of Protein Phosphatase 5 (PP5)
IC50>67047±n/a nM
Citation PubChem, PC Counterscreen for inhibitors of PP1: fluorescence-based biochemical high throughput dose response assay to identify inhibitors of Protein Phosphatase 5 (PP5) PubChem Bioassay(2010)[AID]
 
Trans-activator protein BZLF1
Name:Trans-activator protein BZLF1
Type:Enzyme Catalytic Domain
Mol. Mass.:26856.37
Organism:Human herpesvirus 4
Description:gi_82503229
Residue:245
BDBM54791
NameBDBM54791
Synonyms:5-chloranyl-2-methoxy-N-[3-([1,2,4]triazolo[4,3-b]pyridazin-6-yl)phenyl]benzamide MLS000685766 cid_7217786
TypeSmall organic molecule
Emp. Form.C19H14ClN5O2
Mol. Mass.379.8
SMILESCOc1ccc(Cl)cc1C(=O)Nc1cccc(c1)-c1ccc2nncn2n1