Reaction Details
TargetATP-dependent molecular chaperone HSP82
LigandBDBM34573
Substrate/Competitorn/a
Meas. Tech.Fluorescence Cell-Based Secondary Assay to Identify Inhibitors of Resistant C. albicans Growth in the Presence of Fluconazole
EC50 750±1259 nM
Citation PubChem, PC Fluorescence Cell-Based Secondary Assay to Identify Inhibitors of Resistant C. albicans Growth in the Presence of Fluconazole PubChem Bioassay(2010)[AID]
 
ATP-dependent molecular chaperone HSP82
Name:ATP-dependent molecular chaperone HSP82
Synonyms:heat shock protein 90
Type:Enzyme Catalytic Domain
Mol. Mass.:80784.12
Organism:Candida albicans
Description:gi_994798
Residue:707
BDBM34573
NameBDBM34573
TypeSmall organic molecule
Emp. Form.C18H19N3O
Mol. Mass.293.363
SMILES[O-][N+]1=c2ccc(Nc3ccccc3)cc2=NC11CCCCC1