Reaction Details
TargetATP-dependent molecular chaperone HSP82
LigandBDBM64918
Substrate/Competitorn/a
Meas. Tech.Fluorescence Cell-Based Secondary Assay to Identify Inhibitors of Resistant C. albicans Growth in the Presence of Fluconazole
EC50 1288±1269 nM
Citation PubChem, PC Fluorescence Cell-Based Secondary Assay to Identify Inhibitors of Resistant C. albicans Growth in the Presence of Fluconazole PubChem Bioassay(2010)[AID]
 
ATP-dependent molecular chaperone HSP82
Name:ATP-dependent molecular chaperone HSP82
Synonyms:heat shock protein 90
Type:Enzyme Catalytic Domain
Mol. Mass.:80784.12
Organism:Candida albicans
Description:gi_994798
Residue:707
BDBM64918
NameBDBM64918
TypeSmall organic molecule
Emp. Form.C16H12N2O3S2
Mol. Mass.344.408
SMILESCOC(=O)c1c(NC(=O)c2cccnc2)scc1-c1cccs1