Reaction Details
TargetATP-dependent molecular chaperone HSP82
LigandBDBM34329
Substrate/Competitorn/a
Meas. Tech.Fluorescence Cell-Based Secondary Assay to Identify Inhibitors of Resistant C. albicans Growth in the Presence of Fluconazole
EC50 49292±4208 nM
Citation PubChem, PC Fluorescence Cell-Based Secondary Assay to Identify Inhibitors of Resistant C. albicans Growth in the Presence of Fluconazole PubChem Bioassay(2010)[AID]
 
ATP-dependent molecular chaperone HSP82
Name:ATP-dependent molecular chaperone HSP82
Synonyms:heat shock protein 90
Type:Enzyme Catalytic Domain
Mol. Mass.:80784.12
Organism:Candida albicans
Description:gi_994798
Residue:707
BDBM34329
NameBDBM34329
TypeSmall organic molecule
Emp. Form.C14H13BrN2O4S2
Mol. Mass.417.298
SMILESCCOC(=O)c1sc(=S)n(CC=C)c1NC(=O)c1ccc(Br)o1