Reaction Details
TargetATP-dependent molecular chaperone HSP82
LigandBDBM56983
Substrate/Competitorn/a
Meas. Tech.Fluorescence Cell-Based Secondary Assay to Identify Inhibitors of Resistant C. albicans Growth in the Presence of Fluconazole
EC50 808±1487 nM
Citation PubChem, PC Fluorescence Cell-Based Secondary Assay to Identify Inhibitors of Resistant C. albicans Growth in the Presence of Fluconazole PubChem Bioassay(2010)[AID]
 
ATP-dependent molecular chaperone HSP82
Name:ATP-dependent molecular chaperone HSP82
Synonyms:heat shock protein 90
Type:Enzyme Catalytic Domain
Mol. Mass.:80784.12
Organism:Candida albicans
Description:gi_994798
Residue:707
BDBM56983
NameBDBM56983
TypeSmall organic molecule
Emp. Form.C18H18N4O4S
Mol. Mass.386.425
SMILESCN(Cc1ccccc1)S(=O)(=O)c1ccc(cc1)C(=O)Nc1nnc(C)o1