Reaction Details
TargetInward rectifier potassium channel 2
LigandBDBM65867
Substrate/Competitorn/a
Meas. Tech.Confirmation dose response assay for compounds that inhibit/block inward-rectifying potassium ion channel Kir2.1
IC50 37657±10796 nM
Citation PubChem, PC Confirmation dose response assay for compounds that inhibit/block inward-rectifying potassium ion channel Kir2.1 PubChem Bioassay(2010)[AID]
 
Inward rectifier potassium channel 2
Name:Inward rectifier potassium channel 2
Type:Enzyme Catalytic Domain
Mol. Mass.:48383.35
Organism:Mus musculus
Description:gi_6680530
Residue:428
BDBM65867
NameBDBM65867
Synonyms:(1-benzyl-4-piperidyl)-(4-chlorobenzyl)amine 1-benzyl-N-[(4-chlorophenyl)methyl]piperidin-4-amine N-[(4-chlorophenyl)methyl]-1-(phenylmethyl)-4-piperidinamine SMR000496472 | cid_784405
TypeSmall organic molecule
Emp. Form.C19H23ClN2
Mol. Mass.314.852
SMILESClc1ccc(CNC2CCN(Cc3ccccc3)CC2)cc1