Reaction Details
TargetS-ribosylhomocysteine lyase
LigandBDBM65977
Substrate/Competitorn/a
Meas. Tech.Absorbance Microorganism-Based Dose Retest to Identify Inhibitors of Vibrio harveyi
EC50>160000±n/a nM
Citation PubChem, PC Absorbance Microorganism-Based Dose Retest to Identify Inhibitors of Vibrio harveyi PubChem Bioassay(2010)[AID]
 
S-ribosylhomocysteine lyase
Name:S-ribosylhomocysteine lyase
Synonyms:LuxS
Type:Enzyme Catalytic Domain
Mol. Mass.:15564.06
Organism:Vibrio harveyi
Description:B0LUE4
Residue:140
BDBM65977
NameBDBM65977
TypeSmall organic molecule
Emp. Form.C15H15NO2
Mol. Mass.241.2851
SMILESCCc1ccc(cc1)-c1ccc(C(O)=O)n1C=C