Reaction Details
Target60S ribosomal protein L19-A
LigandBDBM34279
Substrate/Competitorn/a
Meas. Tech.Dose Response of TOR pathway GFP-fusion proteins in Saccharomyes cerevisiae specifically RPL19A based on MLPCN hits
EC50 19050±n/a nM
Citation PubChem, PC Dose Response of TOR pathway GFP-fusion proteins in Saccharomyes cerevisiae specifically RPL19A based on MLPCN hits PubChem Bioassay(2010)[AID]
 
60S ribosomal protein L19-A
Name:60S ribosomal protein L19-A
Type:Enzyme Catalytic Domain
Mol. Mass.:21739.62
Organism:Saccharomyces cerevisiae
Description:gi_536029
Residue:189
BDBM34279
NameBDBM34279
Synonyms:MLS000038506 cid_665303
TypeSmall organic molecule
Emp. Form.C17H8ClN3O2S
Mol. Mass.353.782
SMILESClc1ccccc1N1C(=O)c2sc3nc4ccccc4n3c2C1=O