Reaction Details
Target60S ribosomal protein L19-A
LigandBDBM203
Substrate/Competitorn/a
Meas. Tech.Dose Response of TOR pathway GFP-fusion proteins in Saccharomyes cerevisiae specifically RPL19A based on MLPCN hits
EC50 5053±n/a nM
Citation PubChem, PC Dose Response of TOR pathway GFP-fusion proteins in Saccharomyes cerevisiae specifically RPL19A based on MLPCN hits PubChem Bioassay(2010)[AID]
 
60S ribosomal protein L19-A
Name:60S ribosomal protein L19-A
Type:Enzyme Catalytic Domain
Mol. Mass.:21739.62
Organism:Saccharomyces cerevisiae
Description:gi_536029
Residue:189
BDBM203
NameBDBM203
Synonyms:2-(4-fluorophenyl)-4-quinolinecarboxylic acid [2-[4-[2-furanyl(oxo)methyl]-1-piperazinyl]-2-oxoethyl] ester AC1M5QV8 KUC105874N MLS000879917 SMR000060977 ZINC03215799 [2-[4-(furan-2-ylcarbonyl)piperazin-1-yl]-2-oxidanylidene-ethyl] 2-(4-fluorophenyl)quinoline-4-carboxylate ksc-8-129-6
TypeSmall organic molecule
Emp. Form.C27H22FN3O5
Mol. Mass.487.4791
SMILESFc1ccc(cc1)-c1cc(C(=O)OCC(=O)N2CCN(CC2)C(=O)c2ccco2)c2ccccc2n1