Reaction Details
Target60S ribosomal protein L19-A
LigandBDBM65986
Substrate/Competitorn/a
Meas. Tech.Dose Response of TOR pathway GFP-fusion proteins in Saccharomyes cerevisiae specifically RPL19A based on MLPCN hits
EC50 3177±n/a nM
Citation PubChem, PC Dose Response of TOR pathway GFP-fusion proteins in Saccharomyes cerevisiae specifically RPL19A based on MLPCN hits PubChem Bioassay(2010)[AID]
 
60S ribosomal protein L19-A
Name:60S ribosomal protein L19-A
Type:Enzyme Catalytic Domain
Mol. Mass.:21739.62
Organism:Saccharomyces cerevisiae
Description:gi_536029
Residue:189
BDBM65986
NameBDBM65986
Synonyms:2-(3-bromophenyl)-4-quinolinecarboxylic acid [2-[4-[2-furanyl(oxo)methyl]-1-piperazinyl]-2-oxoethyl] ester MLS000564139 [2-[4-(furan-2-carbonyl)piperazin-1-yl]-2-oxoethyl] 2-(3-bromophenyl)quinoline-4-carboxylate cid_2391688
TypeSmall organic molecule
Emp. Form.C27H22BrN3O5
Mol. Mass.548.385
SMILESBrc1cccc(c1)-c1cc(C(=O)OCC(=O)N2CCN(CC2)C(=O)c2ccco2)c2ccccc2n1