Reaction Details
Target60S ribosomal protein L19-A
LigandBDBM65129
Substrate/Competitorn/a
Meas. Tech.Dose Response of TOR pathway GFP-fusion proteins in Saccharomyes cerevisiae specifically RPL19A based on MLPCN hits
EC50 14410±n/a nM
Citation PubChem, PC Dose Response of TOR pathway GFP-fusion proteins in Saccharomyes cerevisiae specifically RPL19A based on MLPCN hits PubChem Bioassay(2010)[AID]
 
60S ribosomal protein L19-A
Name:60S ribosomal protein L19-A
Type:Enzyme Catalytic Domain
Mol. Mass.:21739.62
Organism:Saccharomyces cerevisiae
Description:gi_536029
Residue:189
BDBM65129
NameBDBM65129
Synonyms:2-({2-nitro-4-[(trifluoromethyl)sulfonyl]phenyl}thio)-1,3-benzothiazole 2-[2-nitro-4-(trifluoromethylsulfonyl)phenyl]sulfanyl-1,3-benzothiazole MLS000573311 cid_2277493
TypeSmall organic molecule
Emp. Form.C14H7F3N2O4S3
Mol. Mass.420.407
SMILES[O-][N+](=O)c1cc(ccc1Sc1nc2ccccc2s1)S(=O)(=O)C(F)(F)F