Reaction Details
Target60S ribosomal protein L19-A
LigandBDBM33111
Substrate/Competitorn/a
Meas. Tech.Dose Response of TOR pathway GFP-fusion proteins in Saccharomyes cerevisiae specifically RPL19A based on MLPCN hits
EC50 6585±n/a nM
Citation PubChem, PC Dose Response of TOR pathway GFP-fusion proteins in Saccharomyes cerevisiae specifically RPL19A based on MLPCN hits PubChem Bioassay(2010)[AID]
 
60S ribosomal protein L19-A
Name:60S ribosomal protein L19-A
Type:Enzyme Catalytic Domain
Mol. Mass.:21739.62
Organism:Saccharomyces cerevisiae
Description:gi_536029
Residue:189
BDBM33111
NameBDBM33111
Synonyms:4,4,4-Trichloro-3-methylamino-1-(4-nitro-phenyl)-butan-1-one 4,4,4-trichloro-3-(methylamino)-1-(4-nitrophenyl)butan-1-one MLS000590271 cid_3739292
TypeSmall organic molecule
Emp. Form.C11H11Cl3N2O3
Mol. Mass.325.576
SMILESCNC(CC(=O)c1ccc(cc1)[N+]([O-])=O)C(Cl)(Cl)Cl