Reaction Details
Target60S ribosomal protein L19-A
LigandBDBM53605
Substrate/Competitorn/a
Meas. Tech.Dose Response of TOR pathway GFP-fusion proteins in Saccharomyes cerevisiae specifically RPL19A based on MLPCN hits
EC50 4618±n/a nM
Citation PubChem, PC Dose Response of TOR pathway GFP-fusion proteins in Saccharomyes cerevisiae specifically RPL19A based on MLPCN hits PubChem Bioassay(2010)[AID]
 
60S ribosomal protein L19-A
Name:60S ribosomal protein L19-A
Type:Enzyme Catalytic Domain
Mol. Mass.:21739.62
Organism:Saccharomyces cerevisiae
Description:gi_536029
Residue:189
BDBM53605
NameBDBM53605
Synonyms:5-[bis(chloranyl)-(1-phenyl-1,2,3,4-tetrazol-5-yl)methyl]-1-phenyl-1,2,3,4-tetrazole 5-[dichloro-(1-phenyltetrazol-5-yl)methyl]-1-phenyl-tetrazole MLS000561802 cid_3090522
TypeSmall organic molecule
Emp. Form.C15H10Cl2N8
Mol. Mass.373.2
SMILESClC(Cl)(c1nnnn1-c1ccccc1)c1nnnn1-c1ccccc1