Reaction Details
TargetAmmonium transporter MEP2
LigandBDBM66023
Substrate/Competitorn/a
Meas. Tech.Dose Response of TOR pathway GFP-fusion proteins in Saccharomyes cerevisiae specifically MEP2 based on MLPCN hits
EC50 1226±n/a nM
Citation PubChem, PC Dose Response of TOR pathway GFP-fusion proteins in Saccharomyes cerevisiae specifically MEP2 based on MLPCN hits PubChem Bioassay(2010)[AID]
 
Ammonium transporter MEP2
Name:Ammonium transporter MEP2
Type:Enzyme Catalytic Domain
Mol. Mass.:53401.07
Organism:Saccharomyces cerevisiae
Description:gi_1302091
Residue:499
BDBM66023
NameBDBM66023
Synonyms:2-octyl-1,2-thiazol-3-one 2-octyl-4-isothiazolin-3-one SMR001370885 | cid_33528
TypeSmall organic molecule
Emp. Form.C11H19NOS
Mol. Mass.213.34
SMILESCCCCCCCCn1sccc1=O