Reaction Details
TargetCitrate synthase, peroxisomal [1-24]
LigandBDBM65312
Substrate/Competitorn/a
Meas. Tech.Dose Response of TOR pathway GFP-fusion proteins in Saccharomyes cerevisiae specifically CIT2 based on MLPCN hits
EC50 3394±n/a nM
Citation PubChem, PC Dose Response of TOR pathway GFP-fusion proteins in Saccharomyes cerevisiae specifically CIT2 based on MLPCN hits PubChem Bioassay(2010)[AID]
 
Citrate synthase, peroxisomal [1-24]
Name:Citrate synthase, peroxisomal [1-24]
Type:Enzyme Catalytic Domain
Mol. Mass.:2731.97
Organism:Saccharomyces cerevisiae
Description:gi_171229
Residue:24
BDBM65312
NameBDBM65312
Synonyms:4-methyl-N-[(1-oxopentylhydrazo)-sulfanylidenemethyl]benzamide 4-methyl-N-[(valerylamino)thiocarbamoyl]benzamide SMR000285923 | cid_1728277
TypeSmall organic molecule
Emp. Form.C14H19N3O2S
Mol. Mass.293.385
SMILESCCCCC(=O)NNC(=S)NC(=O)c1ccc(C)cc1