Reaction Details
TargetCitrate synthase, peroxisomal [1-24]
LigandBDBM66034
Substrate/Competitorn/a
Meas. Tech.Dose Response of TOR pathway GFP-fusion proteins in Saccharomyes cerevisiae specifically CIT2 based on MLPCN hits
EC50 11300±n/a nM
Citation PubChem, PC Dose Response of TOR pathway GFP-fusion proteins in Saccharomyes cerevisiae specifically CIT2 based on MLPCN hits PubChem Bioassay(2010)[AID]
 
Citrate synthase, peroxisomal [1-24]
Name:Citrate synthase, peroxisomal [1-24]
Type:Enzyme Catalytic Domain
Mol. Mass.:2731.97
Organism:Saccharomyces cerevisiae
Description:gi_171229
Residue:24
BDBM66034
NameBDBM66034
Synonyms:(6E)-4-methyl-6-(1,3-thiazol-2-ylhydrazinylidene)cyclohexa-2,4-dien-1-one (6E)-4-methyl-6-(thiazol-2-ylhydrazono)cyclohexa-2,4-dien-1-one SMR001224337 | cid_9576957
TypeSmall organic molecule
Emp. Form.C10H9N3OS
Mol. Mass.219.263
SMILESCc1ccc(O)c(c1)N=Nc1nccs1