Reaction Details
TargetVacuolar aminopeptidase 1
LigandBDBM38921
Substrate/Competitorn/a
Meas. Tech.Dose Response of TOR pathway GFP-fusion proteins in Saccharomyes cerevisiae specifically LAP4 based on MLPCN hits
EC50 30290±n/a nM
Citation PubChem, PC Dose Response of TOR pathway GFP-fusion proteins in Saccharomyes cerevisiae specifically LAP4 based on MLPCN hits PubChem Bioassay(2010)[AID]
 
Vacuolar aminopeptidase 1
Name:Vacuolar aminopeptidase 1
Type:Enzyme Catalytic Domain
Mol. Mass.:57084.90
Organism:Saccharomyces cerevisiae
Description:gi_486173
Residue:514
BDBM38921
NameBDBM38921
Synonyms:MLS000056851 N-[5-(ethylthio)-1,3,4-thiadiazol-2-yl]-2-pyridinecarboxamide SMR000067448 | cid_2121806
TypeSmall organic molecule
Emp. Form.C10H10N4OS2
Mol. Mass.266.343
SMILESCCSc1nnc(NC(=O)c2ccccn2)s1