Reaction Details
TargetVacuolar aminopeptidase 1
LigandBDBM46002
Substrate/Competitorn/a
Meas. Tech.Dose Response of TOR pathway GFP-fusion proteins in Saccharomyes cerevisiae specifically LAP4 based on MLPCN hits
EC50 3791±n/a nM
Citation PubChem, PC Dose Response of TOR pathway GFP-fusion proteins in Saccharomyes cerevisiae specifically LAP4 based on MLPCN hits PubChem Bioassay(2010)[AID]
 
Vacuolar aminopeptidase 1
Name:Vacuolar aminopeptidase 1
Type:Enzyme Catalytic Domain
Mol. Mass.:57084.90
Organism:Saccharomyces cerevisiae
Description:gi_486173
Residue:514
BDBM46002
NameBDBM46002
Synonyms:(6-methyl-2-pyridyl)-[4-(2-pyridyl)thiazol-2-yl]amine N-(6-methyl-2-pyridinyl)-4-(2-pyridinyl)-2-thiazolamine cid_972317
TypeSmall organic molecule
Emp. Form.C14H12N4S
Mol. Mass.268.337
SMILESCc1cccc(Nc2nc(cs2)-c2ccccn2)n1