Reaction Details
TargetVacuolar aminopeptidase 1
LigandBDBM43506
Substrate/Competitorn/a
Meas. Tech.Dose Response of TOR pathway GFP-fusion proteins in Saccharomyes cerevisiae specifically LAP4 based on MLPCN hits
EC50>33000±n/a nM
Citation PubChem, PC Dose Response of TOR pathway GFP-fusion proteins in Saccharomyes cerevisiae specifically LAP4 based on MLPCN hits PubChem Bioassay(2010)[AID]
 
Vacuolar aminopeptidase 1
Name:Vacuolar aminopeptidase 1
Type:Enzyme Catalytic Domain
Mol. Mass.:57084.90
Organism:Saccharomyces cerevisiae
Description:gi_486173
Residue:514
BDBM43506
NameBDBM43506
Synonyms:3-[4-phenyl-6-(trifluoromethyl)pyrimidin-2-yl]sulfonylpropionic acid ethyl ester MLS000051020 cid_2219262 ethyl 3-{[4-phenyl-6-(trifluoromethyl)-2-pyrimidinyl]sulfonyl}propanoate
TypeSmall organic molecule
Emp. Form.C16H15F3N2O4S
Mol. Mass.388.362
SMILESCCOC(=O)CCS(=O)(=O)c1nc(cc(n1)C(F)(F)F)-c1ccccc1