Reaction Details
TargetVacuolar aminopeptidase 1
LigandBDBM43359
Substrate/Competitorn/a
Meas. Tech.Dose Response of TOR pathway GFP-fusion proteins in Saccharomyes cerevisiae specifically LAP4 based on MLPCN hits
EC50 4307±n/a nM
Citation PubChem, PC Dose Response of TOR pathway GFP-fusion proteins in Saccharomyes cerevisiae specifically LAP4 based on MLPCN hits PubChem Bioassay(2010)[AID]
 
Vacuolar aminopeptidase 1
Name:Vacuolar aminopeptidase 1
Type:Enzyme Catalytic Domain
Mol. Mass.:57084.90
Organism:Saccharomyces cerevisiae
Description:gi_486173
Residue:514
BDBM43359
NameBDBM43359
Synonyms:2-bromanyl-N-[5-(4-chlorophenyl)-1,3,4-oxadiazol-2-yl]benzamide MLS000103319 cid_3315017
TypeSmall organic molecule
Emp. Form.C15H9BrClN3O2
Mol. Mass.378.608
SMILESClc1ccc(cc1)-c1nnc(NC(=O)c2ccccc2Br)o1