Reaction Details
TargetVacuolar aminopeptidase 1
LigandBDBM64987
Substrate/Competitorn/a
Meas. Tech.Dose Response of TOR pathway GFP-fusion proteins in Saccharomyes cerevisiae specifically LAP4 based on MLPCN hits
EC50 607±n/a nM
Citation PubChem, PC Dose Response of TOR pathway GFP-fusion proteins in Saccharomyes cerevisiae specifically LAP4 based on MLPCN hits PubChem Bioassay(2010)[AID]
 
Vacuolar aminopeptidase 1
Name:Vacuolar aminopeptidase 1
Type:Enzyme Catalytic Domain
Mol. Mass.:57084.90
Organism:Saccharomyces cerevisiae
Description:gi_486173
Residue:514
BDBM64987
NameBDBM64987
Synonyms:5-nitro-8-quinolinol 8-HYDROXY-5-NITROQUINOLINE SMR000059036 nitroxoline
TypeSmall organic molecule
Emp. Form.C9H6N2O3
Mol. Mass.190.1555
SMILESOc1ccc([N+]([O-])=O)c2cccnc12