Reaction Details
TargetVacuolar aminopeptidase 1
LigandBDBM62224
Substrate/Competitorn/a
Meas. Tech.Dose Response of TOR pathway GFP-fusion proteins in Saccharomyes cerevisiae specifically LAP4 based on MLPCN hits
EC50 16880±n/a nM
Citation PubChem, PC Dose Response of TOR pathway GFP-fusion proteins in Saccharomyes cerevisiae specifically LAP4 based on MLPCN hits PubChem Bioassay(2010)[AID]
 
Vacuolar aminopeptidase 1
Name:Vacuolar aminopeptidase 1
Type:Enzyme Catalytic Domain
Mol. Mass.:57084.90
Organism:Saccharomyces cerevisiae
Description:gi_486173
Residue:514
BDBM62224
NameBDBM62224
Synonyms:(4,5-dibromo-6-oxopyridazin-1-yl)methyl 2,6-difluorobenzoate 2,6-difluorobenzoic acid (4,5-dibromo-6-oxo-1-pyridazinyl)methyl ester SR-01000671432-2 cid_1474490
TypeSmall organic molecule
Emp. Form.C12H6Br2F2N2O3
Mol. Mass.423.992
SMILESFc1cccc(F)c1C(=O)OCn1ncc(Br)c(Br)c1=O