Reaction Details
TargetVacuolar aminopeptidase 1
LigandBDBM47164
Substrate/Competitorn/a
Meas. Tech.Dose Response of TOR pathway GFP-fusion proteins in Saccharomyes cerevisiae specifically LAP4 based on MLPCN hits
EC50 19140±n/a nM
Citation PubChem, PC Dose Response of TOR pathway GFP-fusion proteins in Saccharomyes cerevisiae specifically LAP4 based on MLPCN hits PubChem Bioassay(2010)[AID]
 
Vacuolar aminopeptidase 1
Name:Vacuolar aminopeptidase 1
Type:Enzyme Catalytic Domain
Mol. Mass.:57084.90
Organism:Saccharomyces cerevisiae
Description:gi_486173
Residue:514
BDBM47164
NameBDBM47164
Synonyms:(4,5-dibromo-6-oxopyridazin-1-yl)methyl 4-fluorobenzoate 4-fluorobenzoic acid (4,5-dibromo-6-oxo-1-pyridazinyl)methyl ester SMR000126146 [4,5-dibromo-6-oxo-1(6H)-pyridazinyl]methyl 4-fluorobenzenecarboxylate | cid_1474489
TypeSmall organic molecule
Emp. Form.C12H7Br2FN2O3
Mol. Mass.406.002
SMILESFc1ccc(cc1)C(=O)OCn1ncc(Br)c(Br)c1=O