Reaction Details
TargetVacuolar aminopeptidase 1
LigandBDBM65052
Substrate/Competitorn/a
Meas. Tech.Dose Response of TOR pathway GFP-fusion proteins in Saccharomyes cerevisiae specifically LAP4 based on MLPCN hits
EC50 7771±n/a nM
Citation PubChem, PC Dose Response of TOR pathway GFP-fusion proteins in Saccharomyes cerevisiae specifically LAP4 based on MLPCN hits PubChem Bioassay(2010)[AID]
 
Vacuolar aminopeptidase 1
Name:Vacuolar aminopeptidase 1
Type:Enzyme Catalytic Domain
Mol. Mass.:57084.90
Organism:Saccharomyces cerevisiae
Description:gi_486173
Residue:514
BDBM65052
NameBDBM65052
Synonyms:3,4-dihydro-2H-quinolin-1-yl-[5-(3,4-dihydro-2H-quinolin-1-ylcarbonyl)thiophen-2-yl]methanone MLS000564123 [5-(3,4-dihydro-2H-quinoline-1-carbonyl)-2-thienyl]-(3,4-dihydro-2H-quinolin-1-yl)methanone cid_2314002
TypeSmall organic molecule
Emp. Form.C24H22N2O2S
Mol. Mass.402.509
SMILESO=C(N1CCCc2ccccc12)c1ccc(s1)C(=O)N1CCCc2ccccc12