Reaction Details
TargetVacuolar aminopeptidase 1
LigandBDBM44504
Substrate/Competitorn/a
Meas. Tech.Dose Response of TOR pathway GFP-fusion proteins in Saccharomyes cerevisiae specifically LAP4 based on MLPCN hits
EC50 1362±n/a nM
Citation PubChem, PC Dose Response of TOR pathway GFP-fusion proteins in Saccharomyes cerevisiae specifically LAP4 based on MLPCN hits PubChem Bioassay(2010)[AID]
 
Vacuolar aminopeptidase 1
Name:Vacuolar aminopeptidase 1
Type:Enzyme Catalytic Domain
Mol. Mass.:57084.90
Organism:Saccharomyces cerevisiae
Description:gi_486173
Residue:514
BDBM44504
NameBDBM44504
Synonyms:2-chloro-5-[5-[(E)-(5-cyano-2,6-diketo-4-methyl-3-pyridylidene)methyl]-2-furyl]benzoic acid ethyl ester MLS000519146 cid_6522725 ethyl 2-chloro-5-[5-[(E)-(5-cyano-4-methyl-2,6-dioxopyridin-3-ylidene)methyl]furan-2-yl]benzoate
TypeSmall organic molecule
Emp. Form.C21H15ClN2O5
Mol. Mass.410.807
SMILESCCOC(=O)c1cc(ccc1Cl)-c1ccc(\C=C2\C(=O)NC(=O)C(C#N)=C2C)o1