Reaction Details
TargetVacuolar aminopeptidase 1
LigandBDBM66049
Substrate/Competitorn/a
Meas. Tech.Dose Response of TOR pathway GFP-fusion proteins in Saccharomyes cerevisiae specifically LAP4 based on MLPCN hits
EC50 3036±n/a nM
Citation PubChem, PC Dose Response of TOR pathway GFP-fusion proteins in Saccharomyes cerevisiae specifically LAP4 based on MLPCN hits PubChem Bioassay(2010)[AID]
 
Vacuolar aminopeptidase 1
Name:Vacuolar aminopeptidase 1
Type:Enzyme Catalytic Domain
Mol. Mass.:57084.90
Organism:Saccharomyces cerevisiae
Description:gi_486173
Residue:514
BDBM66049
NameBDBM66049
Synonyms:3-(2,6-Dinitro-4-trifluoromethyl-phenoxy)-7,8,9,10-tetrahydro-benzo[c]chromen-6-one 3-[2,6-dinitro-4-(trifluoromethyl)phenoxy]-7,8,9,10-tetrahydrobenzo[c]chromen-6-one SMR000176220 | cid_3121220
TypeSmall organic molecule
Emp. Form.C20H13F3N2O7
Mol. Mass.450.3216
SMILES[O-][N+](=O)c1cc(cc(c1Oc1ccc2c3CCCCc3c(=O)oc2c1)[N+]([O-])=O)C(F)(F)F