Reaction Details
TargetVacuolar aminopeptidase 1
LigandBDBM62227
Substrate/Competitorn/a
Meas. Tech.Dose Response of TOR pathway GFP-fusion proteins in Saccharomyes cerevisiae specifically LAP4 based on MLPCN hits
EC50 564±n/a nM
Citation PubChem, PC Dose Response of TOR pathway GFP-fusion proteins in Saccharomyes cerevisiae specifically LAP4 based on MLPCN hits PubChem Bioassay(2010)[AID]
 
Vacuolar aminopeptidase 1
Name:Vacuolar aminopeptidase 1
Type:Enzyme Catalytic Domain
Mol. Mass.:57084.90
Organism:Saccharomyces cerevisiae
Description:gi_486173
Residue:514
BDBM62227
NameBDBM62227
Synonyms:5-(4-chlorophenyl)sulfonyl-N-phenyl-1,2,3-thiadiazole-4-carboxamide 5-(4-chlorophenyl)sulfonyl-N-phenyl-thiadiazole-4-carboxamide SR-01000687641 cid_2767048
TypeSmall organic molecule
Emp. Form.C15H10ClN3O3S2
Mol. Mass.379.841
SMILESClc1ccc(cc1)S(=O)(=O)c1snnc1C(=O)Nc1ccccc1