Reaction Details
TargetVacuolar aminopeptidase 1
LigandBDBM66051
Substrate/Competitorn/a
Meas. Tech.Dose Response of TOR pathway GFP-fusion proteins in Saccharomyes cerevisiae specifically LAP4 based on MLPCN hits
EC50 1593±n/a nM
Citation PubChem, PC Dose Response of TOR pathway GFP-fusion proteins in Saccharomyes cerevisiae specifically LAP4 based on MLPCN hits PubChem Bioassay(2010)[AID]
 
Vacuolar aminopeptidase 1
Name:Vacuolar aminopeptidase 1
Type:Enzyme Catalytic Domain
Mol. Mass.:57084.90
Organism:Saccharomyces cerevisiae
Description:gi_486173
Residue:514
BDBM66051
NameBDBM66051
Synonyms:3-[2,5-bis(oxidanylidene)pyrrol-1-yl]-4-chloranyl-N-(4-methylphenyl)benzamide 4-chloro-3-(2,5-dioxo-2,5-dihydro-1H-pyrrol-1-yl)-N-(4-methylphenyl)benzamide 4-chloro-3-maleimido-N-(p-tolyl)benzamide SMR000195810 | cid_885550
TypeSmall organic molecule
Emp. Form.C18H13ClN2O3
Mol. Mass.340.76
SMILESCc1ccc(NC(=O)c2ccc(Cl)c(c2)N2C(=O)C=CC2=O)cc1