Reaction Details
TargetVacuolar aminopeptidase 1
LigandBDBM65990
Substrate/Competitorn/a
Meas. Tech.Dose Response of TOR pathway GFP-fusion proteins in Saccharomyes cerevisiae specifically LAP4 based on MLPCN hits
EC50 3915±n/a nM
Citation PubChem, PC Dose Response of TOR pathway GFP-fusion proteins in Saccharomyes cerevisiae specifically LAP4 based on MLPCN hits PubChem Bioassay(2010)[AID]
 
Vacuolar aminopeptidase 1
Name:Vacuolar aminopeptidase 1
Type:Enzyme Catalytic Domain
Mol. Mass.:57084.90
Organism:Saccharomyces cerevisiae
Description:gi_486173
Residue:514
BDBM65990
NameBDBM65990
Synonyms:3-[2,5-bis(oxidanylidene)pyrrol-1-yl]-N-(2,4-dichlorophenyl)benzamide N-(2,4-dichlorophenyl)-3-(2,5-dioxo-1-pyrrolyl)benzamide N-(2,4-dichlorophenyl)-3-(2,5-dioxopyrrol-1-yl)benzamide SMR000194626 | cid_2275069
TypeSmall organic molecule
Emp. Form.C17H10Cl2N2O3
Mol. Mass.361.179
SMILESClc1ccc(NC(=O)c2cccc(c2)N2C(=O)C=CC2=O)c(Cl)c1