Reaction Details
TargetVacuolar aminopeptidase 1
LigandBDBM54743
Substrate/Competitorn/a
Meas. Tech.Dose Response of TOR pathway GFP-fusion proteins in Saccharomyes cerevisiae specifically LAP4 based on MLPCN hits
EC50 1236±n/a nM
Citation PubChem, PC Dose Response of TOR pathway GFP-fusion proteins in Saccharomyes cerevisiae specifically LAP4 based on MLPCN hits PubChem Bioassay(2010)[AID]
 
Vacuolar aminopeptidase 1
Name:Vacuolar aminopeptidase 1
Type:Enzyme Catalytic Domain
Mol. Mass.:57084.90
Organism:Saccharomyces cerevisiae
Description:gi_486173
Residue:514
BDBM54743
NameBDBM54743
Synonyms:1-(4-piperidin-1-ylphenyl)pyrrole-2,5-dione 1-[4-(1-piperidinyl)phenyl]pyrrole-2,5-dione SMR000289810 | cid_512832
TypeSmall organic molecule
Emp. Form.C15H16N2O2
Mol. Mass.256.2997
SMILESO=C1C=CC(=O)N1c1ccc(cc1)N1CCCCC1