Reaction Details
TargetVacuolar aminopeptidase 1
LigandBDBM66017
Substrate/Competitorn/a
Meas. Tech.Dose Response of TOR pathway GFP-fusion proteins in Saccharomyes cerevisiae specifically LAP4 based on MLPCN hits
EC50 1447±n/a nM
Citation PubChem, PC Dose Response of TOR pathway GFP-fusion proteins in Saccharomyes cerevisiae specifically LAP4 based on MLPCN hits PubChem Bioassay(2010)[AID]
 
Vacuolar aminopeptidase 1
Name:Vacuolar aminopeptidase 1
Type:Enzyme Catalytic Domain
Mol. Mass.:57084.90
Organism:Saccharomyces cerevisiae
Description:gi_486173
Residue:514
BDBM66017
NameBDBM66017
Synonyms:2-chloranyl-N-(2,6-dimethylphenyl)-3-oxidanylidene-3-phenyl-propanamide 2-chloro-N-(2,6-dimethylphenyl)-3-oxo-3-phenylpropanamide SMR000595561 | cid_4484064
TypeSmall organic molecule
Emp. Form.C17H16ClNO2
Mol. Mass.301.767
SMILESCc1cccc(C)c1NC(=O)C(Cl)C(=O)c1ccccc1