Reaction Details
TargetVacuolar aminopeptidase 1
LigandBDBM66018
Substrate/Competitorn/a
Meas. Tech.Dose Response of TOR pathway GFP-fusion proteins in Saccharomyes cerevisiae specifically LAP4 based on MLPCN hits
EC50 1412±n/a nM
Citation PubChem, PC Dose Response of TOR pathway GFP-fusion proteins in Saccharomyes cerevisiae specifically LAP4 based on MLPCN hits PubChem Bioassay(2010)[AID]
 
Vacuolar aminopeptidase 1
Name:Vacuolar aminopeptidase 1
Type:Enzyme Catalytic Domain
Mol. Mass.:57084.90
Organism:Saccharomyces cerevisiae
Description:gi_486173
Residue:514
BDBM66018
NameBDBM66018
Synonyms:5-[[5-(4-chlorophenyl)-2-furanyl]methylidene]-1,3-diazinane-2,4,6-trione 5-[[5-(4-chlorophenyl)furan-2-yl]methylidene]-1,3-diazinane-2,4,6-trione SMR000718285 | cid_2754564
TypeSmall organic molecule
Emp. Form.C15H9ClN2O4
Mol. Mass.316.696
SMILESClc1ccc(cc1)-c1ccc(\[#6]=[#6]-2\[#6](=O)-[#7]-[#6](=O)-[#7]-[#6]-2=O)o1