Reaction Details
TargetBeta-lactamase
LigandBDBM32006
Substrate/Competitorn/a
Meas. Tech.Epi-absorbance-based dose response assay for common IMP-1 and VIM-2 inhibitors: biochemical high throughput screening assay to identify inhibitors of VIM-2 metallo-beta-lactamase
IC50 1392±n/a nM
Citation PubChem, PC Epi-absorbance-based dose response assay for common IMP-1 and VIM-2 inhibitors: biochemical high throughput screening assay to identify inhibitors of VIM-2 metallo-beta-lactamase PubChem Bioassay(2010)[AID]
 
Beta-lactamase
Name:Beta-lactamase
Synonyms:Beta lactamase
Type:Enzyme Catalytic Domain
Mol. Mass.:31513.38
Organism:Pseudomonas aeruginosa
Description:gi_114881106
Residue:286
BDBM32006
NameBDBM32006
TypeSmall organic molecule
Emp. Form.C19H16N2O3
Mol. Mass.320.3419
SMILESCn1c2cccc3C(=O)c4ccccc4-c(c(NCCO)c1=O)c23