Reaction Details
TargetPhotoreceptor-specific nuclear receptor
LigandBDBM33060
Substrate/Competitorn/a
Meas. Tech.TR-FRET-based biochemical high throughput dose response assay for agonists of nuclear receptor subfamily 2, group E, member 3 (NR2E3)
IC50 1090±n/a nM
Citation PubChem, PC TR-FRET-based biochemical high throughput dose response assay for agonists of nuclear receptor subfamily 2, group E, member 3 (NR2E3) PubChem Bioassay(2010)[AID]
 
Photoreceptor-specific nuclear receptor
Name:Photoreceptor-specific nuclear receptor
Type:PROTEIN
Mol. Mass.:44699.83
Organism:Homo sapiens (Human)
Description:ChEMBL_401901
Residue:410
BDBM33060
NameBDBM33060
Synonyms:4-(5-methyl-2-furanyl)-2-sulfanylidene-5,6,7,8-tetrahydro-1H-quinoline-3-carbonitrile 4-(5-methylfuran-2-yl)-2-sulfanylidene-5,6,7,8-tetrahydro-1H-quinoline-3-carbonitrile SMR000102919 | cid_783279
TypeSmall organic molecule
Emp. Form.C15H14N2OS
Mol. Mass.270.349
SMILESCc1ccc(o1)-c1c2CCCCc2[nH]c(=S)c1C#N