Reaction Details
TargetPhotoreceptor-specific nuclear receptor
LigandBDBM41042
Substrate/Competitorn/a
Meas. Tech.TR-FRET-based biochemical high throughput dose response assay for agonists of nuclear receptor subfamily 2, group E, member 3 (NR2E3)
IC50 177.87±n/a nM
Citation PubChem, PC TR-FRET-based biochemical high throughput dose response assay for agonists of nuclear receptor subfamily 2, group E, member 3 (NR2E3) PubChem Bioassay(2010)[AID]
 
Photoreceptor-specific nuclear receptor
Name:Photoreceptor-specific nuclear receptor
Type:PROTEIN
Mol. Mass.:44699.83
Organism:Homo sapiens (Human)
Description:ChEMBL_401901
Residue:410
BDBM41042
NameBDBM41042
Synonyms:7-(4-fluorophenyl)-5-(4-methylphenyl)-4-pyrido[2,3-d]pyrimidinamine 7-(4-fluorophenyl)-5-(4-methylphenyl)pyrido[2,3-d]pyrimidin-4-ylamine SMR000161339 cid_1234281
TypeSmall organic molecule
Emp. Form.C20H15FN4
Mol. Mass.330.3583
SMILESCc1ccc(cc1)-c1cc(nc2ncnc(N)c12)-c1ccc(F)cc1