Reaction Details
TargetPhotoreceptor-specific nuclear receptor
LigandBDBM66169
Substrate/Competitorn/a
Meas. Tech.TR-FRET-based biochemical high throughput dose response assay for agonists of nuclear receptor subfamily 2, group E, member 3 (NR2E3)
IC50 3055±n/a nM
Citation PubChem, PC TR-FRET-based biochemical high throughput dose response assay for agonists of nuclear receptor subfamily 2, group E, member 3 (NR2E3) PubChem Bioassay(2010)[AID]
 
Photoreceptor-specific nuclear receptor
Name:Photoreceptor-specific nuclear receptor
Type:PROTEIN
Mol. Mass.:44699.83
Organism:Homo sapiens (Human)
Description:ChEMBL_401901
Residue:410
BDBM66169
NameBDBM66169
Synonyms:3-phenyl-2-sulfanylidene-1H-[1]benzofuro[3,2-d]pyrimidin-4-one 3-phenyl-2-thioxo-1H-benzofuro[3,2-d]pyrimidin-4-one SMR000236819 | cid_2150404
TypeSmall organic molecule
Emp. Form.C16H10N2O2S
Mol. Mass.294.328
SMILESO=c1n(-c2ccccc2)c(=S)[nH]c2c3ccccc3oc12