Reaction Details
TargetPhotoreceptor-specific nuclear receptor
LigandBDBM66170
Substrate/Competitorn/a
Meas. Tech.TR-FRET-based biochemical high throughput dose response assay for agonists of nuclear receptor subfamily 2, group E, member 3 (NR2E3)
IC50 2320±n/a nM
Citation PubChem, PC TR-FRET-based biochemical high throughput dose response assay for agonists of nuclear receptor subfamily 2, group E, member 3 (NR2E3) PubChem Bioassay(2010)[AID]
 
Photoreceptor-specific nuclear receptor
Name:Photoreceptor-specific nuclear receptor
Type:PROTEIN
Mol. Mass.:44699.83
Organism:Homo sapiens (Human)
Description:ChEMBL_401901
Residue:410
BDBM66170
NameBDBM66170
Synonyms:3-(4-methoxyphenyl)-2-sulfanylidene-1H-[1]benzofuro[3,2-d]pyrimidin-4-one 3-(4-methoxyphenyl)-2-thioxo-1H-benzofuro[3,2-d]pyrimidin-4-one SMR000236839 | cid_7120051
TypeSmall organic molecule
Emp. Form.C17H12N2O3S
Mol. Mass.324.354
SMILESCOc1ccc(cc1)-n1c(=S)[nH]c2c3ccccc3oc2c1=O