Reaction Details
TargetPhotoreceptor-specific nuclear receptor
LigandBDBM50248691
Substrate/Competitorn/a
Meas. Tech.TR-FRET-based biochemical high throughput dose response assay for agonists of nuclear receptor subfamily 2, group E, member 3 (NR2E3)
IC50>39841±n/a nM
Citation PubChem, PC TR-FRET-based biochemical high throughput dose response assay for agonists of nuclear receptor subfamily 2, group E, member 3 (NR2E3) PubChem Bioassay(2010)[AID]
 
Photoreceptor-specific nuclear receptor
Name:Photoreceptor-specific nuclear receptor
Type:PROTEIN
Mol. Mass.:44699.83
Organism:Homo sapiens (Human)
Description:ChEMBL_401901
Residue:410
BDBM50248691
NameBDBM50248691
Synonyms:(1S)-1,5-anhydro-1-(1,3,6,7-tetrahydroxy-9-oxo-9H-xanthen-2-yl)-D-glucitol cid_5358385 | mangiferin
TypeSmall organic molecule
Emp. Form.C19H18O11
Mol. Mass.422.3396
SMILESOC[C@H]1O[C@H]([C@H](O)[C@@H](O)[C@@H]1O)c1c(O)cc2oc3cc(O)c(O)cc3c(=O)c2c1O