Reaction Details
TargetIsoform 2 of Nuclear receptor corepressor 2 (TRAC-1)
LigandBDBM66173
Substrate/Competitorn/a
Meas. Tech.Counterscreen for agonists of nuclear receptor subfamily 2, group E, member 3 (NR2E3)
IC50 1297±n/a nM
Citation PubChem, PC Counterscreen for agonists of nuclear receptor subfamily 2, group E, member 3 (NR2E3): TR-FRET-based biochemical high throughput dose response assay to identify agonists of the interaction between peroxisome proliferator-activated receptor gamma (PPARg) and nuclear receptor co-repressor 2 (NCOR2) PubChem Bioassay(2010)[AID]
 
Isoform 2 of Nuclear receptor corepressor 2 (TRAC-1)
Name:Isoform 2 of Nuclear receptor corepressor 2 (TRAC-1)
Type:Enzyme Catalytic Domain
Mol. Mass.:81401.89
Organism:Homo sapiens (Human)
Description:Q9Y618-2 gi_116256445
Residue:766
BDBM66173
NameBDBM66173
Synonyms:MLS000666816 N-(5-bromo-2-pyridinyl)-2-[2-(2,6-dimethylanilino)-2-oxoethoxy]benzamide N-(5-bromo-2-pyridyl)-2-[2-(2,6-dimethylanilino)-2-keto-ethoxy]benzamide SMR000271402 | cid_1329083
TypeSmall organic molecule
Emp. Form.C22H20BrN3O3
Mol. Mass.454.317
SMILESCc1cccc(C)c1NC(=O)COc1ccccc1C(=O)Nc1ccc(Br)cn1