Reaction Details
TargetIsoform 2 of Nuclear receptor corepressor 2 (TRAC-1)
LigandBDBM47284
Substrate/Competitorn/a
Meas. Tech.Counterscreen for agonists of nuclear receptor subfamily 2, group E, member 3 (NR2E3)
IC50 1390±n/a nM
Citation PubChem, PC Counterscreen for agonists of nuclear receptor subfamily 2, group E, member 3 (NR2E3): TR-FRET-based biochemical high throughput dose response assay to identify agonists of the interaction between peroxisome proliferator-activated receptor gamma (PPARg) and nuclear receptor co-repressor 2 (NCOR2) PubChem Bioassay(2010)[AID]
 
Isoform 2 of Nuclear receptor corepressor 2 (TRAC-1)
Name:Isoform 2 of Nuclear receptor corepressor 2 (TRAC-1)
Type:Enzyme Catalytic Domain
Mol. Mass.:81401.89
Organism:Homo sapiens (Human)
Description:Q9Y618-2 gi_116256445
Residue:766
BDBM47284
NameBDBM47284
Synonyms:2-chloranyl-3-oxidanyl-benzo[c]chromen-6-one 2-chloro-3-hydroxy-6H-benzo[c]chromen-6-one 2-chloro-3-hydroxybenzo[c]chromen-6-one SMR000300153 | cid_5428505
TypeSmall organic molecule
Emp. Form.C13H7ClO3
Mol. Mass.246.646
SMILESOc1cc2oc(=O)c3ccccc3c2cc1Cl