Reaction Details
TargetBcl-2-like protein 11
LigandBDBM47770
Substrate/Competitorn/a
Meas. Tech.Luminescence Cell-Based Dose Retest to Identify Inhibitors of A1 Apoptosis
EC50>350000±n/a nM
Citation PubChem, PC Luminescence Cell-Based Dose Retest to Identify Inhibitors of A1 Apoptosis PubChem Bioassay(2010)[AID]
 
Bcl-2-like protein 11
Name:Bcl-2-like protein 11
Type:PROTEIN
Mol. Mass.:22175.26
Organism:Homo sapiens (Human)
Description:EBI_101325
Residue:198
BDBM47770
NameBDBM47770
Synonyms:4-[5-[(2,2-dimethyl-4,6-dioxo-1,3-dioxan-5-ylidene)methyl]-2-furanyl]benzenesulfonamide 4-[5-[(4,6-diketo-2,2-dimethyl-1,3-dioxan-5-ylidene)methyl]-2-furyl]benzenesulfonamide MLS000703574 cid_1154580
TypeSmall organic molecule
Emp. Form.C17H15NO7S
Mol. Mass.377.369
SMILES[#6]C1([#6])[#8]-[#6](=O)\[#6](=[#6]/c2ccc(o2)-c2ccc(cc2)S([#7])(=O)=O)-[#6](=O)-[#8]1