Reaction Details
TargetNucleotide-binding oligomerization domain-containing protein 2
LigandBDBM65735
Substrate/Competitorn/a
Meas. Tech.SAR analysis of compounds that inhibit NOD2 - Set 3
IC50 1410±n/a nM
Citation PubChem, PC SAR analysis of compounds that inhibit NOD2 - Set 3 PubChem Bioassay(2010)[AID]
 
Nucleotide-binding oligomerization domain-containing protein 2
Name:Nucleotide-binding oligomerization domain-containing protein 2
Type:PROTEIN
Mol. Mass.:115287.18
Organism:Homo sapiens (Human)
Description:ChEMBL_1454053
Residue:1040
BDBM65735
NameBDBM65735
Synonyms:7-butyl-8-[[4-(3-chlorophenyl)-1-piperazinyl]methyl]-1,3-dimethylpurine-2,6-dione 7-butyl-8-[[4-(3-chlorophenyl)piperazin-1-yl]methyl]-1,3-dimethylpurine-2,6-dione MLS-0004183.0001 | cid_666267
TypeSmall organic molecule
Emp. Form.C22H29ClN6O2
Mol. Mass.444.958
SMILESCCCCn1c(CN2CCN(CC2)c2cccc(Cl)c2)nc2n(C)c(=O)n(C)c(=O)c12