Reaction Details
TargetSerine/threonine-protein kinase 33
LigandBDBM24713
Substrate/Competitorn/a
Meas. Tech.Luminescence Cell-Free Homogenous Dose Retest to Identify Inhibitors of Serine/Threonine Kinase 33 Activity
EC50 60970±n/a nM
Citation PubChem, PC Luminescence Cell-Free Homogenous Dose Retest to Identify Inhibitors of Serine/Threonine Kinase 33 Activity PubChem Bioassay(2010)[AID]
 
Serine/threonine-protein kinase 33
Name:Serine/threonine-protein kinase 33
Type:Enzyme Catalytic Domain
Mol. Mass.:57833.21
Organism:Homo sapiens (Human)
Description:gi_23943882
Residue:514
BDBM24713
NameBDBM24713
Synonyms:1,2,4,5-tetrahydropyrazolo[3,4-a]carbazole Tetrahydropyrazolo[3,4-a]carbazole, 19
TypeSmall organic molecule
Emp. Form.C13H11N3
Mol. Mass.209.2465
SMILESC1Cc2c([nH]c3ccccc23)-c2n[nH]cc12