Reaction Details
TargetSerine/threonine-protein kinase 33
LigandBDBM65736
Substrate/Competitorn/a
Meas. Tech.Luminescence Cell-Free Homogenous Dose Retest to Identify Inhibitors of Serine/Threonine Kinase 33 Activity
EC50>120000±n/a nM
Citation PubChem, PC Luminescence Cell-Free Homogenous Dose Retest to Identify Inhibitors of Serine/Threonine Kinase 33 Activity PubChem Bioassay(2010)[AID]
 
Serine/threonine-protein kinase 33
Name:Serine/threonine-protein kinase 33
Type:Enzyme Catalytic Domain
Mol. Mass.:57833.21
Organism:Homo sapiens (Human)
Description:gi_23943882
Residue:514
BDBM65736
NameBDBM65736
Synonyms:7-[(E)-but-2-enyl]-8-[(4-chlorobenzyl)thio]-3-methyl-xanthine 7-[(E)-but-2-enyl]-8-[(4-chlorophenyl)methylsulfanyl]-3-methylpurine-2,6-dione MLS-0018272.0001 | cid_5761205
TypeSmall organic molecule
Emp. Form.C17H17ClN4O2S
Mol. Mass.376.86
SMILESC\C=C\Cn1c(SCc2ccc(Cl)cc2)nc2n(C)c(=O)[nH]c(=O)c12