Reaction Details
TargetSerine/threonine-protein kinase 33
LigandBDBM59083
Substrate/Competitorn/a
Meas. Tech.Luminescence Cell-Free Homogenous Dose Retest to Identify Inhibitors of Serine/Threonine Kinase 33 Activity
EC50 35790±n/a nM
Citation PubChem, PC Luminescence Cell-Free Homogenous Dose Retest to Identify Inhibitors of Serine/Threonine Kinase 33 Activity PubChem Bioassay(2010)[AID]
 
Serine/threonine-protein kinase 33
Name:Serine/threonine-protein kinase 33
Type:Enzyme Catalytic Domain
Mol. Mass.:57833.21
Organism:Homo sapiens (Human)
Description:gi_23943882
Residue:514
BDBM59083
NameBDBM59083
Synonyms:MLS002154065 THONZONIUM BROMIDE cid_11102
TypeSmall organic molecule
Emp. Form.C32H55N4O
Mol. Mass.511.8048
[N+](C)(C)CCN(Cc1ccc(OC)cc1)c1ncccn1