Reaction Details
TargetGuanine nucleotide-binding protein G(o) subunit alpha
LigandBDBM67702
Substrate/Competitorn/a
Meas. Tech.Dose response, multiplexed high-throughput screen for small molecule regulators of RGS family protein interactions, specifically RGS4-Galphao with additional round of SAR compounds.
EC50>30000±0 nM
Citation PubChem, PC Dose response, multiplexed high-throughput screen for small molecule regulators of RGS family protein interactions, specifically RGS4-Galphao with additional round of SAR compounds. PubChem Bioassay(2010)[AID]
 
Guanine nucleotide-binding protein G(o) subunit alpha
Name:Guanine nucleotide-binding protein G(o) subunit alpha
Type:PROTEIN
Mol. Mass.:40043.59
Organism:Homo sapiens (Human)
Description:ChEMBL_321106
Residue:354
BDBM67702
NameBDBM67702
Synonyms:3-chloranyl-N-(3-imidazol-1-ylpropyl)-6-nitro-1-benzothiophene-2-carboxamide 3-chloro-N-(3-imidazol-1-ylpropyl)-6-nitro-benzothiophene-2-carboxamide KSC-1-102c cid_2933863
TypeSmall organic molecule
Emp. Form.C15H13ClN4O3S
Mol. Mass.364.807
SMILES[O-][N+](=O)c1ccc2c(Cl)c(sc2c1)C(=O)NCCCn1ccnc1